Target
Isocitrate lyase
Ligand
BDBM233189
Substrate
Meas. Tech.
ICL Enzyme Assay
Temperature
310.15±0 K
IC50
1.239e+5±n/a nM
Citation
 Sriram, DYogeeswari, PSenthilkumar, PNaidu, GBhat, P 5-Nitro-2,6-dioxohexahydro-4-pyrimidinecarboxamides: synthesis, in vitro antimycobacterial activity, cytotoxicity, and isocitrate lyase inhibition studies. J Enzyme Inhib Med Chem 25:765-72 (2010)  
Target
Name:
Isocitrate lyase
Synonyms:
ACEA_MYCTU Isocitratase Isocitrate lyase (ICL) | icl
Type:
Enzyme
Mol. Mass.:
47072.93
Organism:
Mycobacterium tuberculosis
Description:
P9WKK7
Residue:
428
  
Inhibitor
Name:
BDBM233189
Synonyms:
1-Ethyl-6-fluoro-7-4-[(5-nitro-2,6-dioxohexahydro-4-pyrimidinyl)carbonyl]piperazino-4-oxo-1,4-dihydro-3-quinolinecarboxylic acid (3k)
Type:
Small organic molecule
Emp. Form.:
C21H21FN6O8
Mol. Mass.:
504.4252
SMILES:
CCn1cc(C(O)=O)c(=O)c2cc(F)c(cc12)N1CCN(CC1)C(=O)C1NC(=O)NC(=O)C1[N+]([O-])=O
: