Target
Isocitrate lyase
Ligand
BDBM233190
Substrate
Meas. Tech.
ICL Enzyme Assay
Temperature
310.15±0 K
IC50
>1.210e+5±n/a nM
Citation
 Sriram, DYogeeswari, PSenthilkumar, PNaidu, GBhat, P 5-Nitro-2,6-dioxohexahydro-4-pyrimidinecarboxamides: synthesis, in vitro antimycobacterial activity, cytotoxicity, and isocitrate lyase inhibition studies. J Enzyme Inhib Med Chem 25:765-72 (2010)  
Target
Name:
Isocitrate lyase
Synonyms:
ACEA_MYCTU Isocitratase Isocitrate lyase (ICL) | icl
Type:
Enzyme
Mol. Mass.:
47072.93
Organism:
Mycobacterium tuberculosis
Description:
P9WKK7
Residue:
428
  
Inhibitor
Name:
BDBM233190
Synonyms:
1-Cyclopropyl-6-fluoro-7-4-[(5-nitro-2,6-dioxohexahydro-4-pyrimidinyl)carbonyl]piperazino-4-oxo-1,4-dihydro-3-quinolinecarboxylic acid (3l)
Type:
Small organic molecule
Emp. Form.:
C22H21FN6O8
Mol. Mass.:
516.4359
SMILES:
OC(=O)c1cn(C2CC2)c2cc(N3CCN(CC3)C(=O)C3NC(=O)NC(=O)C3[N+]([O-])=O)c(F)cc2c1=O
: