Target
Tyrosine-protein kinase JAK3
Ligand
BDBM292105
Substrate
Meas. Tech.
Biochemical JAK and Off-Target Kinase Assays
pH
7.5±n/a
Ki
<0.1±n/a nM
Comments
extracted
Citation
 Fatheree, PRJacobsen, JRBeausoleil, ABrandt, GEFleury, MJiang, LSmith, CSullivan, SDVan Orden, LJ JAK kinase inhibitor compounds for treatment of respiratory disease US Patent  US10100049 Publication Date 10/16/2018 
Target
Name:
Tyrosine-protein kinase JAK3
Synonyms:
JAK-3 JAK3_HUMAN Janus kinase 3 (JAK3) L-JAK | Leukocyte janus kinase
Type:
Protein
Mol. Mass.:
125111.08
Organism:
Homo sapiens (Human)
Description:
P52333
Residue:
1124
  
Inhibitor
Name:
BDBM292105
Synonyms:
US10100049, Example 2 US10526330, Example 2 US11299492, Example 2 | US11718616, Example 2
Type:
Small organic molecule
Emp. Form.:
C24H25FN6O
Mol. Mass.:
432.4933
SMILES:
CCc1cc(O)c(F)cc1-c1ccc2c(n[nH]c2c1)-c1nc2CN(CCc2[nH]1)C1CNC1
: