Target
Prolyl endopeptidase FAP
Ligand
BDBM233320
Substrate
Meas. Tech.
Enzymatic Assay
pH
8.3±n/a
Temperature
310.15±n/a K
IC50
670±40 nM
Comments
extracted
Citation
 Jansen, KDe Meester, IHeirbaut, LCheng, JDJoossens, JAugustyns, KVan Der Veken, P FAP inhibitors US Patent  US9346814 Publication Date 5/24/2016 
Target
Name:
Prolyl endopeptidase FAP
Synonyms:
Fap SEPR_MOUSE | Seprase
Type:
Enzyme
Mol. Mass.:
87949.14
Organism:
Mus musculus (Mouse)
Description:
P97321
Residue:
761
  
Inhibitor
Name:
BDBM233320
Synonyms:
US9346814, Ref. Cmpd No 2
Type:
Small organic molecule
Emp. Form.:
C18H17N3O2
Mol. Mass.:
307.3465
SMILES:
O=C(CNC(=O)c1cccc2ccccc12)N1CCCC1C#N
: