Target
Prolyl endopeptidase FAP
Ligand
BDBM50434162
Substrate
Meas. Tech.
Enzymatic Assay
pH
8.3±n/a
Temperature
310.15±n/a K
IC50
190±10 nM
Comments
extracted
Citation
 Jansen, KDe Meester, IHeirbaut, LCheng, JDJoossens, JAugustyns, KVan Der Veken, P FAP inhibitors US Patent  US9346814 Publication Date 5/24/2016 
Target
Name:
Prolyl endopeptidase FAP
Synonyms:
Fap SEPR_MOUSE | Seprase
Type:
Enzyme
Mol. Mass.:
87949.14
Organism:
Mus musculus (Mouse)
Description:
P97321
Residue:
761
  
Inhibitor
Name:
BDBM50434162
Synonyms:
CHEMBL2385274 | US9346814, Cmpd No 9 Example 12
Type:
Small organic molecule
Emp. Form.:
C17H15ClN4O2
Mol. Mass.:
342.78
SMILES:
Clc1cccc2c(ccnc12)C(=O)NCC(=O)N1CCC[C@H]1C#N
: