Target
Prolyl endopeptidase
Ligand
BDBM50009366
Substrate
Meas. Tech.
Enzymatic Assay
pH
8.3±n/a
Temperature
310.15±n/a K
IC50
>1800±200 nM
Comments
extracted
Citation
 Jansen, KDe Meester, IHeirbaut, LCheng, JDJoossens, JAugustyns, KVan Der Veken, P FAP inhibitors US Patent  US9346814 Publication Date 5/24/2016 
Target
Name:
Prolyl endopeptidase
Synonyms:
PE POP PREP Prolyl oligopeptidase
Type:
Enzyme
Mol. Mass.:
80688.50
Organism:
Homo sapiens (Human)
Description:
P48147
Residue:
710
  
Inhibitor
Name:
BDBM50009366
Synonyms:
CHEMBL3233842 US9346814, Cmpd No 1, Example 1
Type:
Small organic molecule
Emp. Form.:
C17H14F2N4O2
Mol. Mass.:
344.3155
SMILES:
FC1(F)C[C@@H](C#N)N(C1)C(=O)CNC(=O)c1ccnc2ccccc12
: