Target
Prolyl endopeptidase
Ligand
BDBM50434164
Substrate
Meas. Tech.
Enzymatic Assay
pH
8.3±n/a
Temperature
310.15±n/a K
IC50
1400±80 nM
Comments
extracted
Citation
 Jansen, KDe Meester, IHeirbaut, LCheng, JDJoossens, JAugustyns, KVan Der Veken, P FAP inhibitors US Patent  US9346814 Publication Date 5/24/2016 
Target
Name:
Prolyl endopeptidase
Synonyms:
PE POP PREP Prolyl oligopeptidase
Type:
Enzyme
Mol. Mass.:
80688.50
Organism:
Homo sapiens (Human)
Description:
P48147
Residue:
710
  
Inhibitor
Name:
BDBM50434164
Synonyms:
CHEMBL2385272 | US9346814, Cmpd No 13 Example 16
Type:
Small organic molecule
Emp. Form.:
C17H15ClN4O2
Mol. Mass.:
342.78
SMILES:
Clc1ccc2c(ccnc2c1)C(=O)NCC(=O)N1CCC[C@H]1C#N
: