Target
Enteropeptidase
Ligand
BDBM234247
Substrate
Meas. Tech.
Inhibition Assay
pH
8±n/a
Ki
0.24±n/a nM
Comments
extracted
Citation
 Suzuki, TKoshiba, TTokumasu, MOhsumi, K Heterocyclic carboxylic acid ester derivative US Patent  US9346821 Publication Date 5/24/2016 
Target
Name:
Enteropeptidase
Synonyms:
ENTK PRSS7 | TMPRSS15
Type:
Enzyme
Mol. Mass.:
112901.62
Organism:
Homo sapiens (Human)
Description:
P98073
Residue:
1019
  
Inhibitor
Name:
BDBM234247
Synonyms:
US9346821, B-14
Type:
Small organic molecule
Emp. Form.:
C21H23FN4O8S2
Mol. Mass.:
542.558
SMILES:
NC(=N)c1ccc(OC(=O)c2ccc(CN3CCC[C@@H]3C(=O)N[C@@H](CS(O)(=O)=O)C(O)=O)s2)c(F)c1
: