Target
Enteropeptidase
Ligand
BDBM234251
Substrate
Meas. Tech.
Inhibition Assay
pH
8±n/a
Ki
1.00±n/a nM
Comments
extracted
Citation
 Suzuki, TKoshiba, TTokumasu, MOhsumi, K Heterocyclic carboxylic acid ester derivative US Patent  US9346821 Publication Date 5/24/2016 
Target
Name:
Enteropeptidase
Synonyms:
ENTK PRSS7 | TMPRSS15
Type:
Enzyme
Mol. Mass.:
112901.62
Organism:
Homo sapiens (Human)
Description:
P98073
Residue:
1019
  
Inhibitor
Name:
BDBM234251
Synonyms:
US9346821, B-21
Type:
Small organic molecule
Emp. Form.:
C22H23FN4O5S2
Mol. Mass.:
506.57
SMILES:
NC(=N)c1ccc(OC(=O)c2ccc(CN3CSC[C@H]3C(=O)N(CC=C)CC(O)=O)s2)c(F)c1
: