Target
5-hydroxytryptamine receptor 3A
Ligand
BDBM233387
Substrate
Meas. Tech.
Ca Flux Activity Assay
Temperature
310.15±n/a K
IC50
1.2±n/a nM
Comments
extracted
Citation
 Hitchcock, SMonenschein, HReichard, HSun, HKikuchi, SMacklin, THopkins, M 5-HT3 receptor antagonists US Patent  US9346829 Publication Date 5/24/2016 
Target
Name:
5-hydroxytryptamine receptor 3A
Synonyms:
5-HT-3 5-HT3A 5-hydroxytryptamine receptor 3 (5-HT3) 5-hydroxytryptamine receptor 3A (5HT3A) 5HT3R HTR3A Serotonin 3 receptor (5HT3) Serotonin-gated ion channel receptor | Serotonin-gated ion channel receptor 3
Type:
Protein
Mol. Mass.:
55283.27
Organism:
Homo sapiens (Human)
Description:
P46098
Residue:
478
  
Inhibitor
Name:
BDBM233387
Synonyms:
US9346829, 26
Type:
Small Organic Molecule
Emp. Form.:
C21H24N4O3
Mol. Mass.:
380.4403
SMILES:
CN1[C@H]2COC[C@@H]1C[C@@H](C2)OC(=O)c1cn(-c2cnn(C)c2)c2ccccc12
: