Target
Tyrosine-protein kinase SYK
Ligand
BDBM233705
Substrate
Meas. Tech.
Homogeneous Time-Resolved Fluorescence (HTRF) Assay
pH
7.5±n/a
Temperature
298.15±n/a K
IC50
18.3±n/a nM
Comments
extracted
Citation
 Haidle, AMBurch, JGuay, DGauthier, JYRobichaud, JFournier, JFEllis, JMChristopher, MKattar, SDSmith, GFNorthrup, AB Substituted phenyl-Spleen Tyrosine Kinase (Syk) inhibitors US Patent  US9353066 Publication Date 5/31/2016 
Target
Name:
Tyrosine-protein kinase SYK
Synonyms:
KSYK_HUMAN Spleen Tyrosine Kinase Tyrosine-protein kinase SYK (Syk)
Type:
Enzyme
Mol. Mass.:
72079.99
Organism:
Homo sapiens (Human)
Description:
P43405
Residue:
635
  
Inhibitor
Name:
BDBM233705
Synonyms:
US9353066, 3.3
Type:
Small Organic Molecule
Emp. Form.:
C23H22F3N3O3
Mol. Mass.:
445.4343
SMILES:
CC(C)COc1ccc(cc1C(O)=O)-c1cc(C)cc(Nc2nccc(n2)C(F)(F)F)c1
: