Target
N-acylethanolamine-hydrolyzing acid amidase
Ligand
BDBM50439659
Substrate
Meas. Tech.
Enzymatic Assay
pH
7.4±n/a
IC50
670±n/a nM
Comments
extracted
Citation
 Piomelli, DBandiera, TMor, MTarzia, GBertozzi, FPonzano, S Disubstituted beta-lactones as inhibitors of N-acylethanolamine acid amidase (NAAA) US Patent  US9353075 Publication Date 5/31/2016 
Target
Name:
N-acylethanolamine-hydrolyzing acid amidase
Synonyms:
ASAH-like protein N-acylethanolamine acid amidase (NAAA) N-acylethanolamine-hydrolyzing acid amidase (NAAA) N-acylethanolamine-hydrolyzing acid amidase subunit beta NAAA_RAT | Naaa
Type:
Enzyme
Mol. Mass.:
40306.53
Organism:
Rattus norvegicus (Rat)
Description:
Q5KTC7
Residue:
362
  
Inhibitor
Name:
BDBM50439659
Synonyms:
CHEMBL2419824 | US9353075, 1
Type:
Small organic molecule
Emp. Form.:
C10H17NO4
Mol. Mass.:
215.2463
SMILES:
CCCCCOC(=O)N[C@@H]1[C@H](C)OC1=O
: