Target
N-acylethanolamine-hydrolyzing acid amidase
Ligand
BDBM233802
Substrate
Meas. Tech.
Fluorogenic Assay
pH
4.5±n/a
IC50
897±n/a nM
Comments
extracted
Citation
 Piomelli, DBandiera, TMor, MTarzia, GBertozzi, FPonzano, S Disubstituted beta-lactones as inhibitors of N-acylethanolamine acid amidase (NAAA) US Patent  US9353075 Publication Date 5/31/2016 
Target
Name:
N-acylethanolamine-hydrolyzing acid amidase
Synonyms:
ASAH-like protein Acid ceramidase-like protein N-acylsphingosine amidohydrolase-like NAAA PLT
Type:
Enzyme
Mol. Mass.:
40073.12
Organism:
Homo sapiens (Human)
Description:
Q02083
Residue:
359
  
Inhibitor
Name:
BDBM233802
Synonyms:
US9353075, 59
Type:
Small organic molecule
Emp. Form.:
C21H23NO4
Mol. Mass.:
353.4116
SMILES:
CC(C)(C)[C@@H]1OC(=O)[C@@H]1NC(=O)OCc1ccc(cc1)-c1ccccc1
: