Target
Guanylate cyclase soluble subunit alpha-1/beta-1
Ligand
BDBM233878
Substrate
Meas. Tech.
Homogeneous Time Resolved Fluorescence Assay
Temperature
298.15±n/a K
EC50
3±n/a nM
Comments
extracted
Citation
 Brenneman, JBGinn, JDHopkins, TDLowe, MDSarko, CRWestbrook, JAYu, MZhang, Z Heterocyclic carboxylic acids as activators of soluble guanylate cyclase US Patent  US9353090 Publication Date 5/31/2016 
Target
Name:
Guanylate cyclase soluble subunit alpha-1/beta-1
Synonyms:
Soluble Guanylate Cyclases Soluble guanylate cyclase alpha 1 and beta 1 subunits (sGC) soluble guanylate cyclase activators | soluble guanylate cyclase apha 1 and soluble guanylate cyclase beta 1
Type:
Enzyme
Mol. Mass.:
Description:
Components:
This complex has 2 components.
Component 1
Name:
Guanylate cyclase soluble subunit alpha-1
Synonyms:
GCS-alpha-1 GCYA1_HUMAN GUCSA3 GUCY1A3 Guanylate cyclase soluble subunit alpha-3 Solube guanylate cyclase alpha-1 (sGCalpha) | soluble guanylate cyclase alpha-1 (sGC)
Type:
Enzyme
Mol. Mass.:
77457.21
Organism:
Homo sapiens (Human)
Description:
Q02108
Residue:
690
  
Component 2
Name:
Guanylate cyclase soluble subunit beta-1
Synonyms:
GCYB1_HUMAN GUCSB3 GUCY1B3 Solube guanylate cyclase beta-1 (sGCβ1) | soluble guanylate cyclase beta-1 (sGC)
Type:
Enzyme
Mol. Mass.:
70496.05
Organism:
Homo sapiens (Human)
Description:
Q02153
Residue:
619
  
Inhibitor
Name:
BDBM233878
Synonyms:
US9353090, 6
Type:
Small organic molecule
Emp. Form.:
C34H39N3O4
Mol. Mass.:
553.6912
SMILES:
Cc1c(COc2ccccc2-c2cccc(n2)N2CC[C@]3(C[C@H]3C2)C(O)=O)ccc2CN(CCc12)C1CCOCC1
: