Target
NAD-dependent protein deacetylase sirtuin-2
Ligand
BDBM234205
Substrate
Meas. Tech.
Inhibition Assay
pH
8±n/a
IC50
105000±n/a nM
Comments
extracted
Citation
 Lin, HHe, B Methods of treatment using modulators of SIRT2 US Patent  US9359293 Publication Date 6/7/2016 
Target
Name:
NAD-dependent protein deacetylase sirtuin-2
Synonyms:
NAD-Dependent Deacetylase Sirtuin-2 NAD-dependent deacetylase sirtuin 3 SIR2-like SIR2L SIR2_HUMAN Sirtuin 2 (SIRT2)
Type:
Hydrolase
Mol. Mass.:
43172.62
Organism:
Homo sapiens (Human)
Description:
Residue:
389
  
Inhibitor
Name:
BDBM234205
Synonyms:
US9359293, TA
Type:
Small organic molecule
Emp. Form.:
C21H25N3O3S
Mol. Mass.:
399.507
SMILES:
CC(=S)NCCCCC(NC(=O)Oc1ccccc1)C(=O)Nc1ccccc1
: