Target
NAD-dependent protein deacetylase sirtuin-1
Ligand
BDBM234207
Substrate
Meas. Tech.
Inhibition Assay
pH
8±n/a
IC50
310±n/a nM
Comments
extracted
Citation
 Lin, HHe, B Methods of treatment using modulators of SIRT2 US Patent  US9359293 Publication Date 6/7/2016 
Target
Name:
NAD-dependent protein deacetylase sirtuin-1
Synonyms:
NAD-Dependent Deacetylase Sirtuin-1 NAD-dependent protein deacetylase sirtuin-1 (SIRT1) SIR2-like protein 1 SIRT1 Sirtuin-1 (SIRT1) | hSIR2
Type:
Developmental protein; hydrolase
Mol. Mass.:
81626.66
Organism:
Homo sapiens (Human)
Description:
Residue:
747
  
Inhibitor
Name:
BDBM234207
Synonyms:
US9359293, TH
Type:
Small organic molecule
Emp. Form.:
C26H35N3O3S
Mol. Mass.:
469.639
SMILES:
CCCCCCC(=S)NCCCCC(NC(=O)Oc1ccccc1)C(=O)Nc1ccccc1
: