Target
Egl nine homolog 1
Ligand
BDBM292138
Substrate
Meas. Tech.
Fluorescence polarization (FP) Assay
Temperature
298.15±n/a K
IC50
4000±n/a nM
Comments
extracted
Citation
 Zhou, YCai, SWang, GJiao, LMin, PJing, YGuo, M Compound of 5-hydroxyl-1,7-naphthyridine substituted by aryloxy or heteroaryloxy, preparation method thereof and pharmaceutical use thereof US Patent  US10100051 Publication Date 10/16/2018 
Target
Name:
Egl nine homolog 1
Synonyms:
C1orf12 EGLN1_HUMAN Hypoxia-inducible factor prolyl hydroxylase 2 (HIF-PH2) Prolyl hydroxylase domain-containing protein 2 (PHD2)
Type:
Protein
Mol. Mass.:
46035.59
Organism:
Homo sapiens (Human)
Description:
Q9GZT9
Residue:
426
  
Inhibitor
Name:
BDBM292138
Synonyms:
2-(2-(4-chlorophenoxy)-5-hydroxy-8-methyl-1,7-naphthyridine-6-formamido) acetic acid | US10100051, Compound 7
Type:
Small organic molecule
Emp. Form.:
C18H14ClN3O5
Mol. Mass.:
387.774
SMILES:
Cc1nc(C(=O)NCC(O)=O)c(O)c2ccc(Oc3ccc(Cl)cc3)nc12
: