Target
Seed linoleate 9S-lipoxygenase-3
Ligand
BDBM234363
Substrate
Meas. Tech.
Lipoxygenase Activity Assay
pH
9±n/a
Temperature
274.15±n/a K
Ki
3430±n/a nM
IC50
35800±3400 nM
Comments
extracted
Citation
 Sadeghian, HSeyedi, SMAttaran, NJabbari, AJafari, Z Synthesis and SAR comparative studies of 2-allyl-4-methoxy-1-alkoxybenzenes as 15-lipoxygenase inhibitors. J Enzyme Inhib Med Chem 26:238-44 (2011)  
Target
Name:
Seed linoleate 9S-lipoxygenase-3
Synonyms:
15-Lipoxygenase (SLO) LOX3 | LOX3_SOYBN
Type:
Enzyme
Mol. Mass.:
96760.05
Organism:
Glycine max (Soybean)
Description:
P09186
Residue:
857
  
Inhibitor
Name:
BDBM234363
Synonyms:
2-Allyl-1-isobutoxy-4-methoxybenzene (4g)
Type:
Small organic molecule
Emp. Form.:
C14H20O2
Mol. Mass.:
220.3074
SMILES:
COc1ccc(OCC(C)C)c(CC=C)c1
: