Target
Cytochrome P450 2D6
Ligand
BDBM234387
Substrate
Meas. Tech.
Isoform-Selective Assay
IC50
7.65e+3±n/a nM
Citation
 Nirogia, RVKambhampati, RDaulatabad, AVGudla, PShaikh, MAchanta, PKShinde, AKDubey, PK Design, synthesis and pharmacological evaluation of conformationally restricted N-arylsulfonyl-3-aminoalkoxy indoles as a potential 5-HT6 receptor ligands. J Enzyme Inhib Med Chem 26:341-9 (2011)  
Target
Name:
Cytochrome P450 2D6
Synonyms:
CP2D6_HUMAN CYP2DL1 Cytochrome P450 2D6 (CYP2D6) P450-DB1
Type:
Protein
Mol. Mass.:
55774.82
Organism:
Homo sapiens (Human)
Description:
P10635
Residue:
497
  
Inhibitor
Name:
BDBM234387
Synonyms:
10-(2-N,N-Dimethylaminoethoxy)-5-Thia-4-b-azaindeno[2,1-a]indene-5,5-Dioxide (8a)
Type:
Small organic molecule
Emp. Form.:
C18H18N2O3S
Mol. Mass.:
342.412
SMILES:
CN(C)CCOc1c2-c3ccccc3S(=O)(=O)n2c2ccccc12
: