Target
Polyphenol oxidase 1
Ligand
BDBM234390
Substrate
Meas. Tech.
Tyrosinase Inhibition Assay
pH
6.8±0
Temperature
298.15±0 K
IC50
>2.00e+5±n/a nM
Citation
 Wu, JHu, XMa, L Synthesis and biological evaluation of polyhydroxy benzophenone as mushroom tyrosinase inhibitors. J Enzyme Inhib Med Chem 26:449-52 (2011)  
Target
Name:
Polyphenol oxidase 1
Synonyms:
PPO1 Polyphenol oxidase | Tyrosinase
Type:
Enzyme
Mol. Mass.:
63902.83
Organism:
Agaricus bisporus (White button mushroom)
Description:
Q00024
Residue:
568
  
Inhibitor
Name:
BDBM234390
Synonyms:
Polyhydroxy benzophenone, 4
Type:
Small organic molecule
Emp. Form.:
C13H10O5
Mol. Mass.:
246.2155
SMILES:
Oc1ccc(C(=O)c2ccc(O)cc2O)c(O)c1
: