Target
Polyphenol oxidase 1
Ligand
BDBM225847
Substrate
Meas. Tech.
Tyrosinase Inhibition Assay
pH
6.8±0
Temperature
298.15±0 K
IC50
1.01e+4±n/a nM
Citation
 Wu, JHu, XMa, L Synthesis and biological evaluation of polyhydroxy benzophenone as mushroom tyrosinase inhibitors. J Enzyme Inhib Med Chem 26:449-52 (2011)  
Target
Name:
Polyphenol oxidase 1
Synonyms:
PPO1 Polyphenol oxidase | Tyrosinase
Type:
Enzyme
Mol. Mass.:
63902.83
Organism:
Agaricus bisporus (White button mushroom)
Description:
Q00024
Residue:
568
  
Inhibitor
Name:
BDBM225847
Synonyms:
Polyhydroxy benzophenone, 8 | hsp90_138
Type:
Small Organic Molecule
Emp. Form.:
C13H10O6
Mol. Mass.:
262.2149
SMILES:
Oc1ccc(C(=O)c2ccc(O)c(O)c2O)c(O)c1
: