Target
UDP-glucuronosyltransferase 1A1
Ligand
BDBM50241343
Substrate
β-estradiol
Meas. Tech.
UDP-glucuronosyltransferase Activity Assay
IC50
5.6e+4± 7e+3 nM
Citation
 Liu, YShe, MWu, ZDai, R The inhibition study of human UDP-glucuronosyltransferases with cytochrome P450 selective substrates and inhibitors. J Enzyme Inhib Med Chem 26:386-93 (2011)  
Target
Name:
UDP-glucuronosyltransferase 1A1
Synonyms:
Bilirubin-specific UDPGT isozyme 1 UD11_HUMAN UDP-glucuronosyltransferase 1-A UDPGT 1-1 UGT1 UGT1-01 UGT1A Uridine-5'-diphosphoglucuronosyltransferase 1A1 | hUG-BR1
Type:
Enzyme
Mol. Mass.:
59604.34
Organism:
Homo sapiens (Human)
Description:
P22309
Residue:
533
  
Inhibitor
Name:
BDBM50241343
Synonyms:
(RS)-6-methoxy-2-((4-methoxy-3,5-dimethylpyridin-2-yl) methylsulfinyl)-1H-benzo[d]imidazole 2-(3-methoxy-2,4-dimethylbenzylsulfinyl)-6-methoxy-1H-benzo[d]imidazole 5-Methoxy-2-(4-methoxy-3,5-dimethyl-pyridin-2-ylmethanesulfinyl)-1H-benzoimidazole (omeprazole) 5-methoxy-2-((4-methoxy-3,5-dimethylpyridin-2-yl)methylsulfinyl)-1H-benzo[d]imidazole 6-methoxy-2-((4-methoxy-3,5-dimethylpyridin-2-yl)methylsulfinyl)-1H-benzo[d]imidazole ESOMEPRAZOLE SODIUM OMEPRAZOLE Prilosec | cid_4594
Type:
Small organic molecule
Emp. Form.:
C17H19N3O3S
Mol. Mass.:
345.416
SMILES:
COc1ccc2nc([nH]c2c1)S(=O)Cc1ncc(C)c(OC)c1C
:
Substrate
Name:
BDBM17292
Synonyms:
(1S,10R,11S,14S,15S)-15-methyltetracyclo[8.7.0.0^{2,7}.0^{11,15}]heptadeca-2,4,6-triene-5,14-diol 17α-ethinylestradiol CHEMBL135 ESTRADIOL Ovocyclin US9040509, E2 US9561238, E2 [2,4,6,7-3H]-E2 [3H]]estradiol
Type:
Steroid
Emp. Form.:
C18H24O2
Mol. Mass.:
272.382
SMILES:
[H][C@@]12CC[C@H](O)[C@@]1(C)CC[C@]1([H])c3ccc(O)cc3CC[C@@]21[H]
: