Target
UDP-glucuronosyltransferase 2B7
Ligand
BDBM31768
Substrate
Diclofenac
Meas. Tech.
UDP-glucuronosyltransferase Activity Assay
IC50
6.0e+4± 8e+3 nM
Citation
 Liu, YShe, MWu, ZDai, R The inhibition study of human UDP-glucuronosyltransferases with cytochrome P450 selective substrates and inhibitors. J Enzyme Inhib Med Chem 26:386-93 (2011)  
Target
Name:
UDP-glucuronosyltransferase 2B7
Synonyms:
2.4.1.17 UD2B7_HUMAN UDP-glucuronosyltransferase 2B9 UDPGT 2B9 UGT2B7 Uridine-5'-diphosphoglucuronosyltransferase 2B7
Type:
Enzyme
Mol. Mass.:
60705.98
Organism:
Homo sapiens (Human)
Description:
P16662
Residue:
529
  
Inhibitor
Name:
BDBM31768
Synonyms:
CHEMBL295698 Nizoral | Panfungol
Type:
Small organic molecule
Emp. Form.:
C26H28Cl2N4O4
Mol. Mass.:
531.431
SMILES:
CC(=O)N1CCN(CC1)c1ccc(OC[C@@H]2CO[C@](Cn3ccnc3)(O2)c2ccc(Cl)cc2Cl)cc1
:
Substrate
Name:
BDBM13066
Synonyms:
2-{2-[(2,6-dichlorophenyl)amino]phenyl}acetic acid Diclofenac US11478464, Compound Diclofenac {2-[(2,6-dichlorophenyl)amino]phenyl}acetic acid
Type:
Small organic molecule
Emp. Form.:
C14H11Cl2NO2
Mol. Mass.:
296.149
SMILES:
OC(=O)Cc1ccccc1Nc1c(Cl)cccc1Cl
: