Target
Metabotropic glutamate receptor 5
Ligand
BDBM292210
Substrate
Meas. Tech.
Calcium Influx Assay Based on Fluorescence
Temperature
298.15±n/a K
EC50
300±n/a nM
Comments
extracted
Citation
 Park, CEJang, YKShin, YJKim, JYHam, SMKim, YGMin, HKCha, SBJung, HJLee, JYHan, SNChung, JYChoi, EJJoung, CMPark, JSLee, JWCho, NRRyu, EJMaeng, CY Imidazopyrimidine and imidazotriazine derivative, and pharmaceutical composition comprising the same US Patent  US10100057 Publication Date 10/16/2018 
Target
Name:
Metabotropic glutamate receptor 5
Synonyms:
GPRC1E GRM5_HUMAN metabotropic glutamate 5 | metabotropic glutamate 5a
Type:
Enzyme
Mol. Mass.:
132484.72
Organism:
Homo sapiens (Human)
Description:
Residue:
1212
  
Inhibitor
Name:
BDBM292210
Synonyms:
US10100057, Example 65 US9745310, Example 65
Type:
Small organic molecule
Emp. Form.:
C19H12F4N4O
Mol. Mass.:
388.3184
SMILES:
Fc1ccc(OCc2cn3cc(cnc3n2)-c2ccc(nc2)C(F)(F)F)cc1
: