Target
Acetylcholinesterase
Ligand
BDBM50059986
Substrate
Meas. Tech.
AChE Inhibition Bioassay
pH
8±n/a
IC50
1.220e+6± 8.0e+4 nM
Comments
extracted
Citation
 Sebestík, JMarques, SMFalé, PLSantos, SArduíno, DMCardoso, SMOliveira, CRSerralheiro, MLSantos, MA Bifunctional phenolic-choline conjugates as anti-oxidants and acetylcholinesterase inhibitors. J Enzyme Inhib Med Chem 26:485-97 (2011)  
Target
Name:
Acetylcholinesterase
Synonyms:
ACES_HUMAN Acetylcholinesterase (AChE) | Acetylcholinesterase (human AChE)
Type:
Enzyme
Mol. Mass.:
67792.70
Organism:
Homo sapiens (Human)
Description:
P22303
Residue:
614
  
Inhibitor
Name:
BDBM50059986
Synonyms:
3-(3,4-dihydroxyphenyl)-2-[(2E)-3-(3,4-dihydroxyphenyl)prop-2-enoyloxy]propanoic acid cid_5315615 | rosmarinic acid
Type:
Small organic molecule
Emp. Form.:
C18H16O8
Mol. Mass.:
360.3148
SMILES:
OC(=O)C(Cc1ccc(O)c(O)c1)OC(=O)\C=C\c1ccc(O)c(O)c1
: