Target
Neuraminidase
Ligand
BDBM234437
Substrate
Meas. Tech.
NA Inhibition Assay
IC50
7780±n/a nM
Citation
 Liu, YZhang, LGong, JFang, HLiu, ADu, GXu, W Design, synthesis, and biological activity of thiazole derivatives as novel influenza neuraminidase inhibitors. J Enzyme Inhib Med Chem 26:506-13 (2011)  
Target
Name:
Neuraminidase
Synonyms:
NA Neuraminidase (NA)
Type:
Enzyme
Mol. Mass.:
49917.65
Organism:
Influenza A virus H3N2
Description:
Q67344
Residue:
446
  
Inhibitor
Name:
BDBM234437
Synonyms:
(S)-2-(2-(2-Amino-4-(methylthio)butanamido)thiazol-4-yl)acetic acid (8d)
Type:
Small organic molecule
Emp. Form.:
C10H15N3O3S2
Mol. Mass.:
289.374
SMILES:
CSCC[C@H](N)C(=O)Nc1nc(CC(O)=O)cs1
: