Target
Neuraminidase
Ligand
BDBM234440
Substrate
Meas. Tech.
NA Inhibition Assay
IC50
34200±n/a nM
Citation
 Liu, YZhang, LGong, JFang, HLiu, ADu, GXu, W Design, synthesis, and biological activity of thiazole derivatives as novel influenza neuraminidase inhibitors. J Enzyme Inhib Med Chem 26:506-13 (2011)  
Target
Name:
Neuraminidase
Synonyms:
NA Neuraminidase (NA)
Type:
Enzyme
Mol. Mass.:
49917.65
Organism:
Influenza A virus H3N2
Description:
Q67344
Residue:
446
  
Inhibitor
Name:
BDBM234440
Synonyms:
(S)-2-(2-(2-(tert-Butoxycarbonylamino)-3-phenylpropanamido)thiazol-4-yl)acetic acid (9c)
Type:
Small organic molecule
Emp. Form.:
C19H23N3O5S
Mol. Mass.:
405.468
SMILES:
CC(C)(C)OC(=O)N[C@@H](Cc1ccccc1)C(=O)Nc1nc(CC(O)=O)cs1
: