Target
Plasmepsin II
Ligand
BDBM234501
Substrate
Meas. Tech.
Enzyme Inhibition Assay
pH
4.5±n/a
Temperature
298.15±n/a K
IC50
36±n/a nM
Comments
extracted
Citation
 Chen, XDing, KMeyers, MJTortorella, MDXu, J Compositions and methods for the treatment of malaria US Patent  US9353089 Publication Date 5/31/2016 
Target
Name:
Plasmepsin II
Synonyms:
Aspartic hemoglobinase II PLM2_PLAFX Plasmepsin 2 Plasmepsin-II
Type:
Enzyme
Mol. Mass.:
51482.09
Organism:
Plasmodium falciparum
Description:
P46925
Residue:
453
  
Inhibitor
Name:
BDBM234501
Synonyms:
US9353089, 128
Type:
Small organic molecule
Emp. Form.:
C23H27N3O3
Mol. Mass.:
393.4788
SMILES:
COc1cccc(c1)C1(NC(=N)N(C2CCCCC2)C1=O)c1cccc(OC)c1
: