Target
Cathepsin D
Ligand
BDBM234541
Substrate
Meas. Tech.
Fluorescence Resonance Energy Transfer (FRET) Assay
pH
4±n/a
Temperature
298.15±n/a K
IC50
934±n/a nM
Comments
extracted
Citation
 Chen, XDing, KMeyers, MJTortorella, MDXu, J Compositions and methods for the treatment of malaria US Patent  US9353089 Publication Date 5/31/2016 
Target
Name:
Cathepsin D
Synonyms:
CATD_HUMAN CTSD Cathepsin D heavy chain Cathepsin D precursor
Type:
Enzyme
Mol. Mass.:
44551.72
Organism:
Homo sapiens (Human)
Description:
Human proCathepsin D (SwissProt accession number P07339) was expressed in Sf9 cells, purified, and autoactivated.
Residue:
412
  
Inhibitor
Name:
BDBM234541
Synonyms:
US9353089, 275
Type:
Small organic molecule
Emp. Form.:
C23H27N3O4
Mol. Mass.:
409.4782
SMILES:
COc1ccc(cc1)C1(NC(=N)N(CC2CCOCC2)C1=O)c1ccc(OC)cc1
: