Target
Platelet-derived growth factor subunit B
Ligand
BDBM234583
Substrate
Meas. Tech.
Kinase Assay
pH
7.4±n/a
IC50
19±n/a nM
Comments
extracted
Citation
 Boral, SMalone, TCWang, S Indole-1-carboxamides as kinase inhibitors US Patent  US9353093 Publication Date 5/31/2016 
Target
Name:
Platelet-derived growth factor subunit B
Synonyms:
PDGF PDGFB Platelet-derived growth factor subunit B SIS
Type:
Enzyme
Mol. Mass.:
27298.80
Organism:
Homo sapiens (Human)
Description:
P01127
Residue:
241
  
Inhibitor
Name:
BDBM234583
Synonyms:
US9353093, 5
Type:
Small organic molecule
Emp. Form.:
C22H16ClFN4O2
Mol. Mass.:
422.839
SMILES:
NC(=O)n1c(cc2ccccc12)-c1ccc(NC(=O)Nc2ccc(F)c(Cl)c2)cc1
: