Target
Platelet-derived growth factor subunit B
Ligand
BDBM234597
Substrate
Meas. Tech.
Kinase Assay
pH
7.4±n/a
IC50
1141±n/a nM
Comments
extracted
Citation
 Boral, SMalone, TCWang, S Indole-1-carboxamides as kinase inhibitors US Patent  US9353093 Publication Date 5/31/2016 
Target
Name:
Platelet-derived growth factor subunit B
Synonyms:
PDGF PDGFB Platelet-derived growth factor subunit B SIS
Type:
Enzyme
Mol. Mass.:
27298.80
Organism:
Homo sapiens (Human)
Description:
P01127
Residue:
241
  
Inhibitor
Name:
BDBM234597
Synonyms:
US9353093, 26
Type:
Small organic molecule
Emp. Form.:
C21H18N4O2S
Mol. Mass.:
390.458
SMILES:
Cc1cccc(NC(=O)Nc2csc(c2)-c2cc3ccccc3n2C(N)=O)c1
: