Target
Cholesteryl ester transfer protein
Ligand
BDBM234626
Substrate
Meas. Tech.
In Vitro Radioactive Assays of CETP-Catalyzed CE and TG Transfer (RTA Assay)
pH
7.4±n/a
Temperature
310.15±n/a K
IC50
22±n/a nM
Comments
extracted
Citation
 Acton, III, JJYe, FVachal, PSha, DDropinski, JFChu, LOndeyka, DKim, AJColandrea, VJZang, YZhang, FDong, G Cyclic amine substituted heterocyclic CETP inhibitors US Patent  US9353101 Publication Date 5/31/2016 
Target
Name:
Cholesteryl ester transfer protein
Synonyms:
CETP Cholesteryl ester transfer protein (CETP) | Lipid transfer protein I
Type:
Enzyme
Mol. Mass.:
54751.53
Organism:
Homo sapiens (Human)
Description:
P11597
Residue:
493
  
Inhibitor
Name:
BDBM234626
Synonyms:
US9353101, 22
Type:
Small organic molecule
Emp. Form.:
C33H31F7N8O4
Mol. Mass.:
736.6393
SMILES:
COc1ncc(cc1-c1cnc(nc1CN1[C@@H](C)[C@H](OC1=O)c1cc(cc(c1)C(F)(F)F)C(F)(F)F)N1CC(F)C1)-c1c(C)nn(CC(N)=O)c1C
: