Target
Cholesteryl ester transfer protein
Ligand
BDBM234668
Substrate
Meas. Tech.
In Vitro Radioactive Assays of CETP-Catalyzed CE and TG Transfer (RTA Assay)
pH
7.4±n/a
Temperature
310.15±n/a K
IC50
271±n/a nM
Comments
extracted
Citation
 Acton, III, JJYe, FVachal, PSha, DDropinski, JFChu, LOndeyka, DKim, AJColandrea, VJZang, YZhang, FDong, G Cyclic amine substituted heterocyclic CETP inhibitors US Patent  US9353101 Publication Date 5/31/2016 
Target
Name:
Cholesteryl ester transfer protein
Synonyms:
CETP Cholesteryl ester transfer protein (CETP) | Lipid transfer protein I
Type:
Enzyme
Mol. Mass.:
54751.53
Organism:
Homo sapiens (Human)
Description:
P11597
Residue:
493
  
Inhibitor
Name:
BDBM234668
Synonyms:
US9353101, 64
Type:
Small organic molecule
Emp. Form.:
C25H23F6N5O3
Mol. Mass.:
555.4722
SMILES:
C[C@H]1[C@H](OC(=O)N1Cc1nc(ncc1-c1c(C)noc1C)N1CCC1)c1cc(cc(c1)C(F)(F)F)C(F)(F)F
: