Target
Fatty acid-binding protein, adipocyte
Ligand
BDBM234703
Substrate
Meas. Tech.
Time Resolved-Fluorescence Energy Transfer (TR-FRET) Assay
pH
7.5±n/a
IC50
27±n/a nM
Comments
extracted
Citation
 Buettelmann, BCeccarelli, SMKuehne, HKuhn, BNeidhart, WObst Sander, URichter, H Non-annulated thiophenylamides US Patent  US9353102 Publication Date 5/31/2016 
Target
Name:
Fatty acid-binding protein, adipocyte
Synonyms:
A-FABP ALBP FABP4 Fatty acid binding protein adipocyte Fatty acid-binding protein 4 (FABP4)
Type:
Enzyme
Mol. Mass.:
14719.23
Organism:
Homo sapiens (Human)
Description:
P15090
Residue:
132
  
Inhibitor
Name:
BDBM234703
Synonyms:
US9353102, 4.9
Type:
Small organic molecule
Emp. Form.:
C21H23N3O3S2
Mol. Mass.:
429.556
SMILES:
Cc1sc(NC(=O)C2=C(C3CCC2CC3)C(O)=O)c(c1C)-c1nc(ns1)C1CC1
: