Target
Fatty acid-binding protein 5
Ligand
BDBM234687
Substrate
Meas. Tech.
Time Resolved-Fluorescence Energy Transfer (TR-FRET) Assay
pH
7.5±n/a
IC50
60±n/a nM
Comments
extracted
Citation
 Buettelmann, BCeccarelli, SMKuehne, HKuhn, BNeidhart, WObst Sander, URichter, H Non-annulated thiophenylamides US Patent  US9353102 Publication Date 5/31/2016 
Target
Name:
Fatty acid-binding protein 5
Synonyms:
FABP5 Fatty acid binding protein epidermal | Fatty acid-binding protein 5 (FABP5)
Type:
Enzyme
Mol. Mass.:
15164.79
Organism:
Homo sapiens (Human)
Description:
Q01469
Residue:
135
  
Inhibitor
Name:
BDBM234687
Synonyms:
US9353102, 6.4
Type:
Small organic molecule
Emp. Form.:
C18H16F3N3O4S
Mol. Mass.:
427.398
SMILES:
Cc1sc(NC(=O)C2=C(CCC2)C(O)=O)c(-c2nc(no2)C2CC2)c1C(F)(F)F
: