Target
Calcium/calmodulin-dependent protein kinase type II subunit delta
Ligand
BDBM292540
Substrate
Meas. Tech.
CaMKII Cell-Based Activity
EC50
3.75±n/a nM
Citation
 Elzein, EKalla, RVKoltun, DLi, XParkhill, EQPerry, TSimonovich, SPZablocki, JZiebenhaus, CA Fused heterocyclic compounds as CaM kinase inhibitors US Patent  US10100058 Publication Date 10/16/2018 
Target
Name:
Calcium/calmodulin-dependent protein kinase type II subunit delta
Synonyms:
CAMK2D CaM kinase II CaMK-II subunit delta Calcium/calmodulin-dependent protein kinase type II subunit delta (CAMK2D) KCC2D_HUMAN
Type:
Enzyme Catalytic Domain
Mol. Mass.:
56419.78
Organism:
Homo sapiens (Human)
Description:
Q13557
Residue:
499
  
Inhibitor
Name:
BDBM292540
Synonyms:
(S)-2-(3-(cyclopropanecarboxamido)azetidin-1-yl)-N-(2-(diethylamino)propyl)-6-(5-(thiophen-2-yl)pyrazolo[1,5-a]pyrimidin-3-yl)isonicotinamide | US10100058, Example 196
Type:
Small organic molecule
Emp. Form.:
C30H36N8O2S
Mol. Mass.:
572.724
SMILES:
CCN(CC)[C@@H](C)CNC(=O)c1cc(nc(c1)-c1cnn2ccc(nc12)-c1cccs1)N1CC(C1)NC(=O)C1CC1
: