Target
Proto-oncogene tyrosine-protein kinase Src [251-533]
Ligand
BDBM234846
Substrate
Meas. Tech.
In vitro Kinase Assay
pH
8±n/a
IC50
>5000±n/a nM
Comments
extracted
Citation
 Garske, ALShokat, KM Methods and compositions for kinase inhibition US Patent  US9353116 Publication Date 5/31/2016 
Target
Name:
Proto-oncogene tyrosine-protein kinase Src [251-533]
Synonyms:
Proto-oncogene tyrosine-protein kinase Src SRC | SRC_CHICK
Type:
Protein
Mol. Mass.:
32360.42
Organism:
Gallus gallus (Chicken)
Description:
Wild-type chicken c-Src kinase domain (251-533aa)
Residue:
283
  
Inhibitor
Name:
BDBM234846
Synonyms:
US9353116, 2
Type:
Small organic molecule
Emp. Form.:
C17H17N5O
Mol. Mass.:
307.3498
SMILES:
CC(C)n1nc(-c2cccc(NC(=O)C=C)c2)c2cncnc12
: