Target
Proto-oncogene tyrosine-protein kinase Src [251-533,T338C]
Ligand
BDBM234848
Substrate
Meas. Tech.
In vitro Kinase Assay
pH
8±n/a
IC50
145±n/a nM
Comments
extracted
Citation
 Garske, ALShokat, KM Methods and compositions for kinase inhibition US Patent  US9353116 Publication Date 5/31/2016 
Target
Name:
Proto-oncogene tyrosine-protein kinase Src [251-533,T338C]
Synonyms:
Proto-oncogene tyrosine-protein kinase Src (T338C) SRC_CHICK
Type:
Protein
Mol. Mass.:
32362.46
Organism:
Gallus gallus (Chicken)
Description:
residues 251-533
Residue:
283
  
Inhibitor
Name:
BDBM234848
Synonyms:
US9353116, 5
Type:
Small organic molecule
Emp. Form.:
C16H18N6O2S
Mol. Mass.:
358.418
SMILES:
CC(C)n1nc(-c2ccc(NS(=O)(=O)C=C)cc2)c2c(N)ncnc12
: