Target
Vascular endothelial growth factor receptor 2 [790-1356]
Ligand
BDBM235397
Substrate
Meas. Tech.
Inhibition Assay
Temperature
303.15±n/a K
IC50
5.7±n/a nM
Comments
extracted
Citation
 Zhang, DZhang, RZhong, BShih, C Cyclopropanecarboxamido-substitute aromatic compounds as anti-tumor agents US Patent  US9359338 Publication Date 6/7/2016 
Target
Name:
Vascular endothelial growth factor receptor 2 [790-1356]
Synonyms:
FLK1 VEGFR2 Vascular endothelial growth factor receptor 2 (KDR)(790-1356) | Vascular endothelial growth factor receptor 2 (VEGFR2)
Type:
Enzyme
Mol. Mass.:
63329.82
Organism:
Homo sapiens (Human)
Description:
P35968[790-1356]
Residue:
567
  
Inhibitor
Name:
BDBM235397
Synonyms:
US9359338, Exe. 007
Type:
Small organic molecule
Emp. Form.:
C22H17ClF3N5O3
Mol. Mass.:
491.85
SMILES:
FC(F)(F)c1cc(NC(=O)Nc2ccc(Oc3cc(NC(=O)C4CC4)ncn3)cc2)ccc1Cl
: