Target
Vascular endothelial growth factor receptor 2 [790-1356]
Ligand
BDBM235541
Substrate
Meas. Tech.
Inhibition Assay
Temperature
303.15±n/a K
IC50
4.5±n/a nM
Comments
extracted
Citation
 Zhang, DZhang, RZhong, BShih, C Cyclopropanecarboxamido-substitute aromatic compounds as anti-tumor agents US Patent  US9359338 Publication Date 6/7/2016 
Target
Name:
Vascular endothelial growth factor receptor 2 [790-1356]
Synonyms:
FLK1 VEGFR2 Vascular endothelial growth factor receptor 2 (KDR)(790-1356) | Vascular endothelial growth factor receptor 2 (VEGFR2)
Type:
Enzyme
Mol. Mass.:
63329.82
Organism:
Homo sapiens (Human)
Description:
P35968[790-1356]
Residue:
567
  
Inhibitor
Name:
BDBM235541
Synonyms:
US9359338, Exe. 151
Type:
Small organic molecule
Emp. Form.:
C25H22F2N4O4
Mol. Mass.:
480.4634
SMILES:
FC1(F)CCOc2ccc(NC(=O)Nc3ccc(Oc4ccnc(NC(=O)C5CC5)c4)cc3)cc12
: