Target
Vascular endothelial growth factor receptor 2 [790-1356]
Ligand
BDBM235565
Substrate
Meas. Tech.
Inhibition Assay
Temperature
303.15±n/a K
IC50
4.9±n/a nM
Comments
extracted
Citation
 Zhang, DZhang, RZhong, BShih, C Cyclopropanecarboxamido-substitute aromatic compounds as anti-tumor agents US Patent  US9359338 Publication Date 6/7/2016 
Target
Name:
Vascular endothelial growth factor receptor 2 [790-1356]
Synonyms:
FLK1 VEGFR2 Vascular endothelial growth factor receptor 2 (KDR)(790-1356) | Vascular endothelial growth factor receptor 2 (VEGFR2)
Type:
Enzyme
Mol. Mass.:
63329.82
Organism:
Homo sapiens (Human)
Description:
P35968[790-1356]
Residue:
567
  
Inhibitor
Name:
BDBM235565
Synonyms:
US9359338, Exe. 175
Type:
Small organic molecule
Emp. Form.:
C23H18F4N4O4
Mol. Mass.:
490.407
SMILES:
Fc1cc(NC(=O)Nc2cccc(OC(F)(F)F)c2)ccc1Oc1ccnc(NC(=O)C2CC2)c1
: