Target
Vascular endothelial growth factor receptor 2 [790-1356]
Ligand
BDBM235566
Substrate
Meas. Tech.
Inhibition Assay
Temperature
303.15±n/a K
IC50
5.7±n/a nM
Comments
extracted
Citation
 Zhang, DZhang, RZhong, BShih, C Cyclopropanecarboxamido-substitute aromatic compounds as anti-tumor agents US Patent  US9359338 Publication Date 6/7/2016 
Target
Name:
Vascular endothelial growth factor receptor 2 [790-1356]
Synonyms:
FLK1 VEGFR2 Vascular endothelial growth factor receptor 2 (KDR)(790-1356) | Vascular endothelial growth factor receptor 2 (VEGFR2)
Type:
Enzyme
Mol. Mass.:
63329.82
Organism:
Homo sapiens (Human)
Description:
P35968[790-1356]
Residue:
567
  
Inhibitor
Name:
BDBM235566
Synonyms:
US9359338, Exe. 176
Type:
Small organic molecule
Emp. Form.:
C23H17F5N4O4
Mol. Mass.:
508.3975
SMILES:
Fc1ccc(OC(F)(F)F)cc1NC(=O)Nc1ccc(Oc2ccnc(NC(=O)C3CC3)c2)c(F)c1
: