Target
Vascular endothelial growth factor receptor 2 [790-1356]
Ligand
BDBM235576
Substrate
Meas. Tech.
Inhibition Assay
Temperature
303.15±n/a K
IC50
5±n/a nM
Comments
extracted
Citation
 Zhang, DZhang, RZhong, BShih, C Cyclopropanecarboxamido-substitute aromatic compounds as anti-tumor agents US Patent  US9359338 Publication Date 6/7/2016 
Target
Name:
Vascular endothelial growth factor receptor 2 [790-1356]
Synonyms:
FLK1 VEGFR2 Vascular endothelial growth factor receptor 2 (KDR)(790-1356) | Vascular endothelial growth factor receptor 2 (VEGFR2)
Type:
Enzyme
Mol. Mass.:
63329.82
Organism:
Homo sapiens (Human)
Description:
P35968[790-1356]
Residue:
567
  
Inhibitor
Name:
BDBM235576
Synonyms:
US9359338, Exe. 186
Type:
Small organic molecule
Emp. Form.:
C28H21F4N5O3
Mol. Mass.:
551.4917
SMILES:
Fc1cc(NC(=O)Nc2cc(cc(c2)C(F)(F)F)-c2cccnc2)ccc1Oc1ccnc(NC(=O)C2CC2)c1
: