Target
Glucagon receptor
Ligand
BDBM235129
Substrate
Meas. Tech.
Binding Assay
pH
7.5±n/a
Temperature
298.15±n/a K
IC50
2.2±n/a nM
Comments
extracted
Citation
 Lin, SZhang, FParmee, ERDewnani, SV Glucagon receptor antagonist compounds, compositions containing such compounds and methods of use US Patent  US9359339 Publication Date 6/7/2016 
Target
Name:
Glucagon receptor
Synonyms:
GCGR GLR_HUMAN Glucagon receptor (GlucR)
Type:
Enzyme
Mol. Mass.:
54026.92
Organism:
Homo sapiens (Human)
Description:
P47871
Residue:
477
  
Inhibitor
Name:
BDBM235129
Synonyms:
US9359339, 8
Type:
Small organic molecule
Emp. Form.:
C30H30ClNO3S
Mol. Mass.:
520.082
SMILES:
CCC[C@@H](C(c1c(C)sc2ccccc12)c1ccc(Cl)cc1)c1ccc(cc1)C(=O)NCCC(O)=O
: