Target
Tyrosine-protein kinase BTK
Ligand
BDBM235157
Substrate
Meas. Tech.
TR-FRET (Time Resolved FRET) Assay
pH
7.15±n/a
Temperature
287.15±n/a K
IC50
1214.6±n/a nM
Comments
extracted
Citation
 Huby, NJLopez-Tapia, FJSo, S Thiazole derivatives as inhibitors of Bruton's tyrosine kinase US Patent  US9359345 Publication Date 6/7/2016 
Target
Name:
Tyrosine-protein kinase BTK
Synonyms:
AGMX1 Agammaglobulinaemia tyrosine kinase B cell progenitor kinase BPK BTK_HUMAN Tyrosine Kinase BTK Tyrosine-protein kinase BTK (BTK)
Type:
Enzyme
Mol. Mass.:
76289.95
Organism:
Homo sapiens (Human)
Description:
Q06187
Residue:
659
  
Inhibitor
Name:
BDBM235157
Synonyms:
US9359345, 3
Type:
Small organic molecule
Emp. Form.:
C19H26N6O3S
Mol. Mass.:
418.513
SMILES:
CC(C)(C)OC(=O)N[C@@H]1CCCN(C1)c1nc(C(N)=O)c(Nc2ccccn2)s1
: