Target
Isoform PDE10A2 of cAMP and cAMP-inhibited cGMP 3',5'-cyclic phosphodiesterase 10A (PDE10A2)
Ligand
BDBM235168
Substrate
Meas. Tech.
Fluorescence Polarization Assay
Temperature
298.15±n/a K
Ki
8.3±n/a nM
Comments
extracted
Citation
 Kuduk, SDBeshore, DCReger, TS Cyclopropyl imidazopyridine PDE10 inhibitors US Patent  US9359348 Publication Date 6/7/2016 
Target
Name:
Isoform PDE10A2 of cAMP and cAMP-inhibited cGMP 3',5'-cyclic phosphodiesterase 10A (PDE10A2)
Synonyms:
PDE10A Phosphodiesterase 10A Phosphodiesterase 10A2 cAMP and cAMP-inhibited cGMP 3',5'-cyclic phosphodiesterase 10A (PDE10A2)
Type:
Enzyme
Mol. Mass.:
89387.03
Organism:
Homo sapiens (Human)
Description:
Q9Y233-2
Residue:
789
  
Inhibitor
Name:
BDBM235168
Synonyms:
US9359348, 2
Type:
Small organic molecule
Emp. Form.:
C20H21N7
Mol. Mass.:
359.4276
SMILES:
Cc1nc(C)n(n1)-c1cc(nc(C)n1)[C@@H]1C[C@H]1c1cn2c(C)cccc2n1
: