Target
Alpha-1,6-mannosyl-glycoprotein 2-beta-N-acetylglucosaminyltransferase
Ligand
BDBM235229
Substrate
Meas. Tech.
LCMS Assay
pH
7.4±n/a
Temperature
338.15±n/a K
IC50
10±n/a nM
Comments
extracted
Citation
 Ahmad, SNegash, LA Dihydropyridinone MGAT2 inhibitors US Patent  US9365558 Publication Date 6/14/2016 
Target
Name:
Alpha-1,6-mannosyl-glycoprotein 2-beta-N-acetylglucosaminyltransferase
Synonyms:
2.4.1.143 GNT-II MGAT2 Mannoside acetylglucosaminyltransferase 2 Monoacylglycerol acyltransferase type 2 (h-MGAT2) h-MGAT2 (human monoacylglycerol acyltransferase type 2)
Type:
Mol. Mass.:
51567.80
Organism:
Homo sapiens (Human)
Description:
Q10469
Residue:
447
  
Inhibitor
Name:
BDBM235229
Synonyms:
US9365558, 52 | US9822074, 52
Type:
Small organic molecule
Emp. Form.:
C28H29F7N4O4S
Mol. Mass.:
650.608
SMILES:
Fc1cc(CCCCC(F)(F)F)ccc1[C@@]1(CC(c2ccn(CC3CC3)n2)=C(C(=O)NS(=O)(=O)C2CC2)C(=O)N1)C(F)(F)F
: