Target
cGMP-dependent 3',5'-cyclic phosphodiesterase
Ligand
BDBM292712
Substrate
Meas. Tech.
PDE2 Inhibition In Vitro Assay
pH
7.2±n/a
Temperature
298.15±n/a K
IC50
73.0±n/a nM
Comments
extracted
Citation
 Li, PZheng, HSnyder, GWennogle, LPHendrick, J Organic compounds US Patent  US10105349 Publication Date 10/23/2018 
Target
Name:
cGMP-dependent 3',5'-cyclic phosphodiesterase
Synonyms:
CGS-PDE Homo sapiens phosphodiesterase 2A (PDE2A) PDE2A cGSPDE
Type:
Enzyme Catalytic Domain
Mol. Mass.:
105691.58
Organism:
Homo sapiens (Human)
Description:
O00408
Residue:
941
  
Inhibitor
Name:
BDBM292712
Synonyms:
8-Chloro-1-(2,5-dichlorophenyl)-3-methyl-1H-pyrazolo[4,3-c][1,5]naphthyridin-4(5H)-one US10543194, Example 19
Type:
Small organic molecule
Emp. Form.:
C16H9Cl3N4O
Mol. Mass.:
379.628
SMILES:
Cc1nn(-c2cc(Cl)ccc2Cl)c2c1c(=O)[nH]c1ccc(Cl)nc21
: