Target
Tumor necrosis factor
Ligand
BDBM235370
Substrate
Meas. Tech.
ELISA Assay
Temperature
298.15±n/a K
IC50
0.9±n/a nM
Comments
extracted
Citation
 Mjalli, AMGaddam, BPolisetti, DRKostura, MJGuzel, M Tricyclic compounds as modulators of TNF-alpha synthesis and as PDE4 inhibitors US Patent  US9393245 Publication Date 7/19/2016 
Target
Name:
Tumor necrosis factor
Synonyms:
Cachectin TNF-a TNFA TNFSF2 Tumor necrosis factor (TNFa) Tumor necrosis factor ligand superfamily member 2 Tumor necrosis factor, soluble form | tumor necrosis factor alpha
Type:
Enzyme
Mol. Mass.:
25645.11
Organism:
Homo sapiens (Human)
Description:
P01375
Residue:
233
  
Inhibitor
Name:
BDBM235370
Synonyms:
US10085990, Example 100 | US9393245, 100
Type:
Small organic molecule
Emp. Form.:
C25H24ClN3O3
Mol. Mass.:
449.929
SMILES:
COc1cccc2c1ncc1c2n(C2CCC(C)CC2)c(=O)n(-c2ccc(Cl)cc2)c1=O
: