Target
Isoform PDE4B2 of cAMP-specific 3',5'-cyclic phosphodiesterase 4B (PDE4B2)
Ligand
BDBM135819
Substrate
Meas. Tech.
TR-FRET-Based Assay
Temperature
303.15±n/a K
IC50
17±n/a nM
Comments
extracted
Citation
 Mjalli, AMGaddam, BPolisetti, DRKostura, MJGuzel, M Tricyclic compounds as modulators of TNF-alpha synthesis and as PDE4 inhibitors US Patent  US9393245 Publication Date 7/19/2016 
Target
Name:
Isoform PDE4B2 of cAMP-specific 3',5'-cyclic phosphodiesterase 4B (PDE4B2)
Synonyms:
DPDE4 PDE4B2 cAMP-specific 3',5'-cyclic phosphodiesterase 4B (PDE4B2) | phosphodiesterase 4B2
Type:
Enzyme
Mol. Mass.:
64320.36
Organism:
Homo sapiens (Human)
Description:
Q07343-2
Residue:
564
  
Inhibitor
Name:
BDBM135819
Synonyms:
US10085990, Example 103 US8853226, 103 | US9393245, 103
Type:
Small organic molecule
Emp. Form.:
C25H22ClN3O5
Mol. Mass.:
479.912
SMILES:
COc1cccc2c1ncc1c2n(C2CC[C@@H](CC2)C(O)=O)c(=O)n(-c2cccc(Cl)c2)c1=O
: